{"text_format":"2","workbook":"xlsx","n_sheets":2,"sheets":["Pre-Approval Form","Tables"],"not_rendered":{"charts":0,"images":0,"macros":0,"external_links":0,"defined_names":0,"comments":0,"pivot_tables":0},"unopened":[],"bounds":{"document_bytes":16777216,"sheet_cells":100000,"run_cost":"one","rows_first":2000,"rows_last":500,"rows_between":2000,"halvings":0,"cell_chars":16384,"cell_head_chars":4096},"cells_cut":0,"cells_raw":0,"read":"whole","date_system":"1900"}

{"sheet":"Pre-Approval Form","index":0,"n_rows":69,"n_cols":18,"rows_kept":69,"cut":false,"hidden":false,"merged":[[51,2,51,5],[51,7,51,8],[51,12,51,13],[52,2,52,3],[52,4,52,5],[52,6,52,9],[52,10,52,11],[52,12,52,13],[48,12,48,13],[48,2,48,5],[48,7,48,8],[49,2,49,3],[49,4,49,5],[49,6,49,9],[49,10,49,11],[49,12,49,13],[45,2,45,5],[45,7,45,8],[45,12,45,13],[46,2,46,3],[46,4,46,5],[46,6,46,9],[46,10,46,11],[46,12,46,13],[10,1,10,13],[11,1,11,2],[11,3,11,6],[11,7,11,8],[11,9,11,13],[14,1,14,3],[14,4,14,6],[14,7,14,8],[17,4,18,13],[16,1,16,3],[16,4,16,6],[14,9,14,13],[15,1,15,3],[15,4,15,6],[15,7,15,9],[15,10,15,13],[5,7,5,11],[5,12,5,13],[6,1,6,13],[7,1,7,2],[7,3,7,6],[7,7,7,8],[7,9,7,13],[8,1,8,2],[8,3,8,6],[8,7,8,8],[8,9,8,13],[11,17,11,23],[12,1,12,2],[12,3,12,6],[12,7,12,8],[12,9,12,13],[13,1,13,2],[13,3,13,6],[13,7,13,8],[13,9,13,13],[21,1,21,5],[21,6,21,7],[21,8,21,9],[21,10,21,13],[22,1,22,5],[22,6,22,7],[22,8,22,9],[22,10,22,13],[16,7,16,13],[20,1,20,5],[20,6,20,7],[20,8,20,9],[20,10,20,13],[25,1,25,5],[25,6,25,7],[25,8,25,9],[25,10,25,13],[26,1,26,5],[26,6,26,7],[26,8,26,9],[26,10,26,13],[23,1,23,5],[23,6,23,7],[23,8,23,9],[23,10,23,13],[24,1,24,5],[24,6,24,7],[24,8,24,9],[24,10,24,13],[27,1,27,2],[27,3,27,5],[27,6,27,7],[27,8,27,9],[27,10,27,13],[28,1,28,2],[28,3,28,5],[28,6,28,7],[28,8,28,9],[28,10,28,13],[34,1,34,13],[35,1,35,2],[35,3,35,6],[35,7,35,8],[35,9,35,13],[37,1,37,13],[29,1,29,2],[29,3,29,5],[29,6,29,7],[29,8,29,9],[29,10,29,13],[30,6,30,7],[30,8,30,9],[30,10,30,11],[30,12,30,13],[32,1,32,13],[42,2,42,5],[42,7,42,8],[42,12,42,13],[43,2,43,3],[43,4,43,5],[43,6,43,9],[43,10,43,11],[43,12,43,13],[38,1,38,13],[39,2,39,5],[39,7,39,8],[39,12,39,13],[40,2,40,3],[40,4,40,5],[40,6,40,9],[40,10,40,11],[40,12,40,13],[57,1,57,3],[57,4,57,13],[58,1,58,3],[58,4,58,9],[58,11,58,13],[60,1,60,13],[54,1,54,13],[55,1,55,3],[55,4,55,13],[56,1,56,3],[56,4,56,9],[56,11,56,13],[68,7,68,8],[68,9,68,13],[64,1,64,13],[65,1,65,3],[65,4,65,13],[66,1,66,3],[66,4,66,9],[66,11,66,13],[61,1,61,2],[61,3,61,6],[61,7,61,8],[61,9,61,13],[62,1,62,2],[62,3,62,6],[62,7,62,8],[62,9,62,13]]}
[]
[]
[]
[]
[]
[null,"Green cells are drop down cells and yellow cells are entry cells",{"$nulls":5},"Trip Number (Assigned by Financial Services)"]
[null,"Employee Information"]
[null,"Employee Name",{"$nulls":5},"Position"]
[null,"Employee Number",{"$nulls":5},"Phone Extension"]
[]
[null,"Trip Details ( if attending conference/course attach itinerary)"]
[null,"Destination",{"$nulls":5},"Departure Date",{"$nulls":9}," "]
[null,"Purpose of Trip",{"$nulls":5},"Return Date"]
[null,"Name of Conference ",{"$nulls":5},"Date of Conference"]
[null,"Planned Departure Time",{"$nulls":5},"Planned Return Time"]
[null,"Any portion of trip personal?",{"$nulls":5},"Date of Personal Travel"]
[null,"If Foreign Travel, travel advisory checked",{"$nulls":5},"https://travel.gc.ca/travelling/advisories"]
[null,"Additional Information/Notes:"]
[]
[]
[null,"Estimated Travel Costs",{"$nulls":4},"Estimated Cost",null,"Personal Portion",null,"Anticipated Payment Method"]
[null,"Airfare"]
[null,"Accommodations"]
[null,"Per Diems (see below)"]
[null,"Ground Transportation"]
[null,"Personal Vehicle/Mileage ($0.55/km)"]
[null,"Conference/Course Registration"]
[null,"Other (Specify)"]
[null,"Other (Specify)"]
[null,"Other (Specify)"]
[null,"Totals",{"$nulls":4},{"$f":"+SUM(G22:H30)","v":0},null,{"$f":"+SUM(I22:J30)","v":0},null,{"$f":"+G31-I31","v":0},null,"Business Portion"]
[null,"Per Diem and Incidental Rates - Breakfast- $22,   Lunch- $22 ,  Dinner- $28.50,  Incidentals - $14.00/24 Hour Period"]
[null,"See Business and Travel Expense Rate Schedule for additional information on claiming meals per diems and incidentals"]
[]
[null,"Travel Approval Signature (Supervisor, to allow travel)"]
[null,"Supervisor's Name",{"$nulls":5},"Supervisor's Signature"]
[]
[null,"Cost Centre Information "]
[null,"Note - Total Dollars allocated to all cost centers should agree to Business Portion above"]
[null,"Acct 1","Account",{"$nulls":4},"Split  Based On",null,"%",null,"Enter $ or %"]
[null,"CC #","?",null,"CC  Name",null,{"$f":"VLOOKUP($C$41,Tables!E1:F281,2,FALSE)","v":"?"},null,null,null,"    Sub CC"]
[]
[null,"Acct 2","Account",{"$nulls":4},"Split  Based On",null,"%",null,"Enter $ or %"]
[null,"CC #","?",null,"CC  Name",null,{"$f":"VLOOKUP($C$44,Tables!E1:F281,2,FALSE)","v":"?"},null,null,null,"    Sub CC"]
[]
[null,"Acct 3","Account",{"$nulls":4},"Split  Based On",null,"%",null,"Enter $ or %"]
[null,"CC #","?",null,"CC  Name",null,{"$f":"VLOOKUP($C$47,Tables!E1:F281,2,FALSE)","v":"?"},null,null,null,"    Sub CC"]
[]
[null,"Acct 4","Account",{"$nulls":4},"Split  Based On",null,"%",null,"Enter $ or %"]
[null,"CC #","?",null,"CC  Name",null,{"$f":"VLOOKUP($C$50,Tables!E1:F281,2,FALSE)","v":"?"},null,null,null,"    Sub CC"]
[]
[null,"Acct 5","Account",{"$nulls":4},"Split  Based On",null,"%",null,"Enter $ or %"]
[null,"CC #","?",null,"CC  Name",null,{"$f":"VLOOKUP($C$53,Tables!E1:F281,2,FALSE)","v":"?"},null,null,null,"    Sub CC"]
[]
[null,"Spending Authority Approvals (Budget holder, to allow expenses)"]
[null,"Spending Authority Name Acct #1"]
[null,"Spending Authority Signature Acct #1",null,null," ",{"$nulls":5},"Date"]
[null,"Spending Authority Name Acct #2"]
[null,"Spending Authority Signature Acct #2",{"$nulls":8},"Date"]
[]
[null,"Travel Advance Information (if applicable - See Section 12 of the Business Travel Expense Directive)"]
[null,"Amount",{"$nulls":5},"Reason for Request"]
[null,"Approver Name",{"$nulls":5},"Approver Signature"]
[]
[null,"Approval for Travel Outside of Canada (see Section 3 of the Business Travel Expense Directive)"]
[null,"Name"]
[null,"Signature",{"$nulls":8},"Date"]
[]
[{"$nulls":7},"Traveler's Signature"]

{"sheet":"Tables","index":1,"n_rows":281,"n_cols":6,"rows_kept":281,"cut":false,"hidden":false,"merged":[]}
["Purpose of Trip",null,"Account",null,"Cost Centre","Name"]
[null,null,"61400 - Travel",null,"?","?"]
["Student Recruitment",null,"61740 - Student Recruitment Travel",null,101000,"Board of Governors"]
["Conference",null,"23005 - Faculty Personal ProD",null,101500,"Board and Administrative Services"]
["Research",null,"23010 - Faculty Pooled ProD",null,102500,"President's Office - Philip Steenkamp"]
["Course/Professional Development",null,"23007 - Academic Admin Supplement",null,105000,"VP and CFO"]
["Advancement",null,"23011 - Internal Research Grant",null,105200,"Business Performance & Analysis"]
["Governance",null,"22054 - Research Allowance",null,106000,"Advancement"]
["Working Out of Province/Country",null,"61750 - Student Recruitment Events",null,106200,"Alumni Relations"]
["Other",null,"61731 - Travel - Business Development",null,107600,"Operations and Resilience"]
[null,null,"62227 - Program Delivery:  Field Trips",null,120000,"Human Resources"]
[{"$nulls":4},120005,"HR - Centralized Funds"]
["Column1",null,null,null,120010,"HR Corporate"]
["Yes",null,"Payment Method",null,120160,"Faculty Pro-D Pool"]
["No",null,"?",null,130000,"Financial Services"]
["N/A",null,"Individual will pay and submit expense claim",null,130010,"Finance Corporate"]
["?",null,"Individual will pay - no expense to RRU",null,130500,"Financial Reporting and Compliance"]
[null,null,"Individual will pay and be reimbursed by external source",null,180000,"Marketing - General"]
[null,null,"Expense invoiced directly to RRU",null,182000,"Marketing - Corporate"]
["Column1",null,"Expense charged to RRU corporate credit card",null,182020,"International Collaboration and Development"]
["$",null,null,null,182050,"Program Development: Marketing"]
["%",null,null,null,182051,"Program Development: Marketing (Recruitment)"]
[{"$nulls":4},182052,"Program Development: Int'l Marketing and Recruitment"]
[{"$nulls":4},182150,"Admissions and Enrolment Services"]
["Travel",null,null,null,182175,"Marketing: Program Delivery Items"]
[{"$nulls":4},182400,"Communications and Community Relations"]
[{"$nulls":4},182425,"Community Relations/Outlook Events"]
[{"$nulls":4},182700,"Marketing - Student Recruitment"]
[{"$nulls":4},182710,"Marketing - Student Recruitment (Schools)"]
[{"$nulls":4},182720,"Marketing - Pathways"]
[{"$nulls":4},182800,"VP, Communications and Advancement"]
[{"$nulls":4},182850,"Communications and Advancement Operations"]
[{"$nulls":4},183000,"Indigenous Engagement"]
[{"$nulls":4},184000,"Global Recruitment & Partnerships"]
[{"$nulls":4},184005,"Global Digital Recruitment"]
[{"$nulls":4},184010,"Global Partner Recruitment"]
[{"$nulls":4},184015,"Student Recruitment"]
[{"$nulls":4},184020,"Global Partnerships"]
[{"$nulls":4},184025,"Program Quality:  Recruitment"]
[{"$nulls":4},185000,"VP Research & International"]
[{"$nulls":4},185005,"Office of Equity, Diversity and Inclusion"]
[{"$nulls":4},185030,"Indigenous Education"]
[{"$nulls":4},185080,"Business Development"]
[{"$nulls":4},186000,"Student Services"]
[{"$nulls":4},186015,"Financial Aid & Awards"]
[{"$nulls":4},200000,"VP Academic Provost"]
[{"$nulls":4},200100,"Office of Research Services"]
[{"$nulls":4},200226,"RESH - SSHRC - Inst Grant Program"]
[{"$nulls":4},200227,"RESH - SSHRC - Research Support Fund"]
[{"$nulls":4},200603,"CIS CIFOR Consultancy - Belcher"]
[{"$nulls":4},200634,"Vannini (CRC) Renewal, SCC"]
[{"$nulls":4},200639,"Vannini, SSHRC IG, Natural Wild Canadian, SCC"]
[{"$nulls":4},200648,"Prasad, CRC, SoB"]
[{"$nulls":4},200658,"Cox,SSHRC Insight, SHS"]
[{"$nulls":4},200661,"Dodd, CFI IOF: Mass Spectrometer, SES"]
[{"$nulls":4},200663,"Hartney, School District 61, SLS"]
[{"$nulls":4},200664,"Hartney, CIHR Project, DESTINED, SLS"]
[{"$nulls":4},200665,"Banting-Newell, SES"]
[{"$nulls":4},200666,"Mittelman, SSHRC IDG, Exploration Chartiable Giving, SoB"]
[{"$nulls":4},200667,"Bird, Canada History Fund, War Memories Across Canada, Episode III, STHM"]
[{"$nulls":4},200668,"Pulla SSHRC IDB Social Licensing CoIS"]
[{"$nulls":4},200673,"Pulla, SSHRC UVic: Reclaiming language through theatre, CIS"]
[{"$nulls":4},200674,"Dodd, Lundin, SES"]
[{"$nulls":4},200675,"Dallimore, PromoSci2018, SES"]
[{"$nulls":4},200676,"Bird, Wilderness Tourism Association, STHM"]
[{"$nulls":4},200677,"Hartney,MSFHR CS, SLS"]
[{"$nulls":4},200678,"Jorgensen, SSHRC IG, FoM"]
[{"$nulls":4},200679,"King, SSHRC IG, SES"]
[{"$nulls":4},200680,"Rekar Munro, SSHRC IG, FoM"]
[{"$nulls":4},200681,"Lokanan, SSHRC IDG, Investment Industry Regulatory Organization, SoB"]
[{"$nulls":4},200682,"Takach, SSHRC IDG, Interweaving Traditional Ecological Knowledge, SCC"]
[{"$nulls":4},200683,"Das, SSHRC IDG, Energy deprivation in everyday living, CoIS"]
[{"$nulls":4},200684,"Prasad, SSHRC IDG, Determinants motivating diaspora entrepreneurs, SoB"]
[{"$nulls":4},200685,"Dallimore, Gov't NWT, Geologic Investigation, Village of Tuktoyaktuk, SES"]
[{"$nulls":4},200686,"Veletsianos, CRC, CRC Renewal, SET"]
[{"$nulls":4},200687,"Dale, UFV, SES"]
[{"$nulls":4},200688,"Hodson, MITACS, CIS"]
[{"$nulls":4},200689,"Hartney, SSHRC Connection, SoLS"]
[{"$nulls":4},200690,"Dallimore, NRCan, SES"]
[{"$nulls":4},200691,"Cox, NRCan, SHS"]
[{"$nulls":4},200692,"Belcher, PowerToBE TOC Facilitation, CIS"]
[{"$nulls":4},200693,"Belcher, Ashoka Research Chair, CIS"]
[{"$nulls":4},200694,"Bird, MNR Heritage, Workshop STHS"]
[{"$nulls":4},200695,"Dallimore, NSERC PromoSci2019,SES"]
[{"$nulls":4},200696,"Kajzer Mitchell & Zidulka, Ministry of Health, SoB"]
[{"$nulls":4},200697,"Newell, SSHRC, PEG, SES"]
[{"$nulls":4},200698,"RESH NSRC EDICap"]
[{"$nulls":4},200699,"Cox, BCCAS, SHS"]
[{"$nulls":4},200700,"RESH: Global Advancement & Diversity Fund (Fdn #104)"]
[{"$nulls":4},200701,"RESH: Buttedahl Skene Fund (Fdn)"]
[{"$nulls":4},200704,"RESH: Conference Seed Fund (CSF)"]
[{"$nulls":4},200705,"RESH, Ministry of Health (MOH), ORS"]
[{"$nulls":4},200706,"Restricted Research Funds"]
[{"$nulls":4},200720,"Mitac _ Wasdani Parsad SoB"]
[{"$nulls":4},200721,"Mitac_Heykoop, Vancouver Foundation, SoL"]
[{"$nulls":4},200722,"DALE CFIIOF CoLabs SES"]
[{"$nulls":4},200723,"Hartney, Van Foundation, Dementia, SLS"]
[{"$nulls":4},200724,"Heykoop, Micahel Smith convene, SoL"]
[{"$nulls":4},200725,"Homer-Dixon,McConell, Cascade, SES"]
[{"$nulls":4},200726,"Homer-Dixon,Winslow,Cascade, SES"]
[{"$nulls":4},200727,"Dale, Ryerson, SES"]
[{"$nulls":4},200728,"Madan, City of Colwood, SHS"]
[{"$nulls":4},200729,"Hodson, SSHRC Connection, CIS"]
[{"$nulls":4},200730,"Dale, CAGS, Student Roundtable, SES"]
[{"$nulls":4},200731,"Wolfe, SSHRC, Waterloo Sub Award, SES"]
[{"$nulls":4},200732,"Bird, Saanich, Trees, SoTHM"]
[{"$nulls":4},200733,"Veletsianos, CIHR, COVID19, SET"]
[{"$nulls":4},200734,"Hodson, SSHRC Insight, CIS"]
[{"$nulls":4},200735,"DAS, SSHRC PEG, Low-carbon, CIS"]
[{"$nulls":4},200736,"Bernard, SSHRC, Applied Doctorial Research, COIS"]
[{"$nulls":4},200737,"Cox, SSHRC Insight, SHS"]
[{"$nulls":4},200738,"BIRD, Valour Canada, STHM"]
[{"$nulls":4},200739,"HomerDixon, McConnel WGSI, Cascade"]
[{"$nulls":4},200740,"Deimling & Hill, Mindful Campuses 2020, HR/ORS"]
[{"$nulls":4},200741,"Hartney, Cdn Frailty Network, SLS"]
[{"$nulls":4},200743,"Hodson, CRC, CIS"]
[{"$nulls":4},200744,"Hachigian, SSHRC PEG, FoM"]
[{"$nulls":4},200745,"WilsonMah, BCcampus, STHM"]
[{"$nulls":4},200746,"RRU, NSERC, EDICAP Stipend"]
[{"$nulls":4},200747,"WilsonMah, Selkirk College, STHM"]
[{"$nulls":4},200748,"Veletsianos, SSHRC IDG, Future of Higher Education, SET"]
[{"$nulls":4},200749,"Steenkamp, CRCEWF, Research Services"]
[{"$nulls":4},200750,"Research Targets - External"]
[{"$nulls":4},200751,"Das, SSHRC,PDG CMHC"]
[{"$nulls":4},200752,"Hartney, CHLNet, COVID19 Leading Through Crisis, SLS"]
[{"$nulls":4},200753,"Hodson, SSHRC - Ryerson, Anti-Social Social Media, CIS"]
[{"$nulls":4},200754,"Cox, NRCAN, Climate Course, SHS"]
[{"$nulls":4},200755,"MacArthur, Tier2 CRC, SoB"]
[{"$nulls":4},200756,"Rowe, SSHRC, COVID-19 Stress Adaptation for Teachers, SLS"]
[{"$nulls":4},200757,"Walinga, SSHRC PEG, SCC"]
[{"$nulls":4},200758,"Homer-Dixon, General/Misc, Cascade Institute"]
[{"$nulls":4},200759,"Dodd, Health Canada, SES"]
[{"$nulls":4},200760,"Cox, BC Gov, MicroCred, SHS"]
[{"$nulls":4},200761,"Furukawa, Mitacs PostDoc, ORS"]
[{"$nulls":4},200762,"Hodson, SSHRC KSG, A New Glass Ceiling, CIS"]
[{"$nulls":4},200763,"Pulla, SSHRC SFU, HLCS, CIS"]
[{"$nulls":4},200764,"Madan, ELHRA, SHS"]
[{"$nulls":4},200765,"Jones, SSHRC PEG, CIS"]
[{"$nulls":4},200766,"Hartney, SSHRC PEG, SLS"]
[{"$nulls":4},200767,"Cox, CRI, SHS"]
[{"$nulls":4},200768,"Cox, NRCan Platofrm, SHS"]
[{"$nulls":4},200769,"Irwin, MCICFIT, Malawi, FoM"]
[{"$nulls":4},200770,"Dale, SSHRC IG, SES"]
[{"$nulls":4},200771,"Hachigian, Vancouver Foundation SCG, FoM"]
[{"$nulls":4},200772,"Homer-Dixon, McConnell, Cascade, SES"]
[{"$nulls":4},200773,"Walinga, SSHRC PEG (Own the Podium), SCC"]
[{"$nulls":4},200774,"Slick, CWF GBV Pandemic Study, SHS"]
[{"$nulls":4},200775,"Lokanan, SSHRC IDG, SoB"]
[{"$nulls":4},200776,"Smith-Carrier, CRC Tier 2, SHS"]
[{"$nulls":4},200777,"Manion, WorkBC with ZeroCeiling, SHS"]
[{"$nulls":4},200778,"Madan, Ashoka,SHS"]
[{"$nulls":4},200779,"Dodd, BC Gov Windy Craggy, SES"]
[{"$nulls":4},200780,"Heykoop, MSFHR Scholar, SLS"]
[{"$nulls":4},200800,"General Restricted Research Funds"]
[{"$nulls":4},201100,"Climate Leadership"]
[{"$nulls":4},201101,"UN SDGs"]
[{"$nulls":4},201102,"Ashoka"]
[{"$nulls":4},211000,"Registration Services"]
[{"$nulls":4},211050,"International Admissions"]
[{"$nulls":4},213000,"Director of Admissions and Registrar"]
[{"$nulls":4},215000,"Faculty Affairs"]
[{"$nulls":4},221000,"Library Services"]
[{"$nulls":4},222100,"CTET"]
[{"$nulls":4},222151,"CTET - Program Quality"]
[{"$nulls":4},223000,"Textbook Services"]
[{"$nulls":4},230000,"AVP: Student and Academic Services"]
[{"$nulls":4},250000,"School of Tourism & Hospitality Management"]
[{"$nulls":4},250001,"School of T&HM - Research"]
[{"$nulls":4},250002,"School of T&HM - Service"]
[{"$nulls":4},250005,"SoTHM Case Competition Competing Team"]
[{"$nulls":4},250200,"BA International Hotel Management - On Campus"]
[{"$nulls":4},250250,"BA International Hotel Management - Online"]
[{"$nulls":4},250750,"MA Tourism Management - On Campus"]
[{"$nulls":4},250800,"BA Global Tourism Management"]
[{"$nulls":4},250850,"MA & Cert Tourism Management - Blended"]
[{"$nulls":4},250950,"Year 2 Tourism Programs"]
[{"$nulls":4},260000,"Media Support Services"]
[{"$nulls":4},320100,"MA & Dip Learning and Technology"]
[{"$nulls":4},400000,"School of Environment & Sustainability - Management"]
[{"$nulls":4},400001,"School of Environment and Sustainability - Research"]
[{"$nulls":4},400002,"School of Environmental Science - Service"]
[{"$nulls":4},405000,"BA/BSc & Cert in Environmental Practice"]
[{"$nulls":4},405100,"MA/MSc in Environmental Practice"]
[{"$nulls":4},405200,"CCEE - Management"]
[{"$nulls":4},405400,"Graduate Certificate in Science and Policy of Climate Change"]
[{"$nulls":4},410000,"BSc in Environmental Science"]
[{"$nulls":4},410500,"BSc in Environmental Management - Blended"]
[{"$nulls":4},430000,"MA / MSc in Environment & Management-Blended"]
[{"$nulls":4},430050,"MA/MSc in Environment and Management-On Campus"]
[{"$nulls":4},450000,"BSc - Major Student Projects"]
[{"$nulls":4},460016,"Student Research Grants"]
[{"$nulls":4},470000,"MA, Dip & Cert: Environmental Ed and Communication"]
[{"$nulls":4},500000,"Faculty of Management"]
[{"$nulls":4},500200,"FoM: School of Business"]
[{"$nulls":4},500201,"School of Business - Research"]
[{"$nulls":4},500202,"School of Business - Service"]
[{"$nulls":4},510000,"MBA"]
[{"$nulls":4},510500,"Doctor of Business Administration"]
[{"$nulls":4},519009,"MA in Environment and Management (MEM) - Offshore"]
[{"$nulls":4},530000,"BCom - On Campus"]
[{"$nulls":4},530003,"BCom - Blended"]
[{"$nulls":4},530005,"SoB Case Competition Competing Team"]
[{"$nulls":4},530006,"RRU Design Thinking Challenge"]
[{"$nulls":4},540500,"Eric C. Douglass Ctre for Entrepreneurial Studies Fund"]
[{"$nulls":4},540510,"Micro-Lending Fund"]
[{"$nulls":4},540540,"CCSBE Secretariat Agreement"]
[{"$nulls":4},550000,"Master of Global Management"]
[{"$nulls":4},550100,"Master of Global Management - Blended"]
[{"$nulls":4},570000,"Bachelors of Business Administration"]
[{"$nulls":4},570100,"Bachelors of Business Administration Year 2"]
[{"$nulls":4},580100,"GC: Advanced Coaching Practices"]
[{"$nulls":4},580200,"GC: Organization Design & Development"]
[{"$nulls":4},580300,"GC: Workplace Innovation"]
[{"$nulls":4},580400,"GC: Change Management"]
[{"$nulls":4},580500,"GC: Corporate Social Innovation"]
[{"$nulls":4},580600,"GC: Management and Leadership"]
[{"$nulls":4},580700,"Project Management and Organizational Leadership - DIP"]
[{"$nulls":4},600012,"MA & Cert Intercultural & International Communication"]
[{"$nulls":4},600020,"MAIIC - On Campus"]
[{"$nulls":4},610000,"MA Leadership"]
[{"$nulls":4},610008,"MA & Dip in Education Leadership and Management"]
[{"$nulls":4},610009,"MA in Education Leadership and Management - Offshore"]
[{"$nulls":4},610010,"BA in Professional Communication - Blended"]
[{"$nulls":4},610011,"MA in Professional Communication"]
[{"$nulls":4},610012,"BA in Professional Communication - On Campus"]
[{"$nulls":4},610013,"GC: Instructional Design"]
[{"$nulls":4},610015,"GC: Online Learning Facilitation"]
[{"$nulls":4},610016,"MA in Education Leadership and Management - MLES"]
[{"$nulls":4},610020,"School of Communication & Culture - Management"]
[{"$nulls":4},610021,"School of Communication & Culture - Research"]
[{"$nulls":4},610022,"School of Communication & Culture - Service"]
[{"$nulls":4},610025,"GC: Intercultural Communication and Leadership"]
[{"$nulls":4},620045,"MA Leadership - Health"]
[{"$nulls":4},620500,"School of Leadership Studies - Management"]
[{"$nulls":4},620502,"School of Leadership - Research"]
[{"$nulls":4},620503,"School of Leadership - Service"]
[{"$nulls":4},620510,"MA, Cert & Dip Global Leadership - Blended"]
[{"$nulls":4},620520,"MA, Cert & Dip Global Leadership - On Campus"]
[{"$nulls":4},620600,"SLS: Leadership Conference"]
[{"$nulls":4},640000,"School of Education and Technology - Management"]
[{"$nulls":4},640001,"School of Educ and Technology - Research"]
[{"$nulls":4},640002,"School of Education & Technology - Service"]
[{"$nulls":4},640100,"MA and GC's - Higher Education Admin and Leadership"]
[{"$nulls":4},640200,"DIP: Technology-Enhanced Learning and Design"]
[{"$nulls":4},700000,"School of Humanitarian Studies - Management"]
[{"$nulls":4},700001,"School of Humanitarian Studies - Research"]
[{"$nulls":4},700002,"School of Humanitarian Studies - Service"]
[{"$nulls":4},700040,"BA in Inter-Disciplinary Studies"]
[{"$nulls":4},700050,"MA in Inter-Disciplinary Studies"]
[{"$nulls":4},705000,"MA and DIP Human Security & Peacebuilding"]
[{"$nulls":4},706000,"MA and DIP Disaster and Emergency Management"]
[{"$nulls":4},707000,"MA and Dip Climate Action Leadership"]
[{"$nulls":4},708000,"GC: Child Protection to Wellbeing"]
[{"$nulls":4},710000,"MA and DIP Conflict Analysis & Management"]
[{"$nulls":4},720000,"BA Justice Studies - Blended"]
[{"$nulls":4},720100,"BA Justice Studies - OnCampus"]
[{"$nulls":4},720200,"MA and DIP Justice Studies"]
[{"$nulls":4},750000,"FSAS - Management"]
[{"$nulls":4},750100,"Doctor of Social Sciences"]
[{"$nulls":4},750150,"CoIS - Management"]
[{"$nulls":4},750151,"COIS - Research"]
[{"$nulls":4},750152,"COIS - Service"]
[{"$nulls":4},750155,"Interdisciplinary UG Year One"]
[{"$nulls":4},900200,"GC: Human Resources"]
[{"$nulls":4},900201,"GC: Project Management"]
[{"$nulls":4},900202,"GC: Executive Coaching"]
[{"$nulls":4},900204,"GC: Professional Communication Management"]
[{"$nulls":4},900229,"GC: Leadership and Management"]
[{"$nulls":4},900233,"MA Leadership-Executive & GC Value Based Leadership"]
[{"$nulls":4},900285,"PCS: Micro Credentials 2020/21"]
[{"$nulls":4},900290,"PCS: Future Skills, Project Connect"]
[{"$nulls":4},900300,"P&CS:  English for Academic Purposes"]
[{"$nulls":4},950000,"Professional and Continuing Studies, AVP - Mgmt"]
[{"$nulls":4},960000,"Professional and Continuing Studies - Programs Mgmt"]
[{"$nulls":4},960100,"PSC Grants - Credit Programs"]
[{"$nulls":4},960300,"DCL - Custom Programs"]
[{"$nulls":4},960500,"DCL - Package Programs"]
[{"$nulls":4},970000,"Global Learning and Language Centre - Mgmt"]
[{"$nulls":4},970300,"International Custom Learning - Custom Programs"]
[{"$nulls":4},970500,"GLLC Open Enrolment Package Programs"]
[{"$nulls":4},970700,"GD: Project Mgmt & Org Leadership - Royal Bridge"]